Reaction Details
TargetCoagulation factor X
LigandBDBM50189310
Substrate/Competitorn/a
Meas. Tech.ChEMBL_1591274 (CHEMBL3829807)
Ki 327±n/a nM
Citation Beckmann, AMGilberg, EGattner, SHuang, TLVanden Eynde, JJMayence, ABajorath, JStirnberg, MGütschow, M Evaluation of bisbenzamidines as inhibitors for matriptase-2. Bioorg Med Chem Lett26:3741-5 (2016) 
 
Coagulation factor X
Name:Coagulation factor X
Type:PROTEIN
Mol. Mass.:54498.45
Organism:Bos taurus
Description:ChEMBL_1364435
Residue:492
BDBM50189310
NameBDBM50189310
Synonyms:4,4''-(1,4-Phenylenebis(Methylene))Bis(Oxy)Dibenzimidamide | CHEMBL365916
TypeSmall organic molecule
Emp. Form.C22H22N4O2
Mol. Mass.374.4357
SMILESNC(=N)c1ccc(OCc2ccc(COc3ccc(cc3)C(N)=N)cc2)cc1