Reaction Details
TargetPeregrin
LigandBDBM50189340
Substrate/Competitorn/a
Meas. Tech.ChEMBL_1589340 (CHEMBL3830584)
IC50 100±n/a nM
Citation Bamborough, PBarnett, HABecher, IBird, MJChung, CWCraggs, PDDemont, EHDiallo, HFallon, DJGordon, LJGrandi, PHobbs, CIHooper-Greenhill, EJones, EJLaw, RPLe Gall, ALugo, DMichon, AMMitchell, DJPrinjha, RKSheppard, RJWatson, AJWatson, RJ GSK6853, a Chemical Probe for Inhibition of the BRPF1 Bromodomain. ACS Med Chem Lett7:552-7 (2016) 
 
Peregrin
Name:Peregrin
Type:PROTEIN
Mol. Mass.:137524.47
Organism:Homo sapiens (Human)
Description:ChEMBL_108054
Residue:1214
BDBM50189340
NameBDBM50189340
Synonyms:CHEMBL3828146
TypeSmall organic molecule
Emp. Form.C23H28N4O5
Mol. Mass.440.4922
SMILESCC(C)Oc1cc2n(C)c(=O)n(C)c2cc1NC(=O)c1ccccc1OCC(=O)N(C)C