Reaction Details
TargetPeregrin
LigandBDBM50189350
Substrate/Competitorn/a
Meas. Tech.ChEMBL_1589340 (CHEMBL3830584)
IC50 794±n/a nM
Citation Bamborough, PBarnett, HABecher, IBird, MJChung, CWCraggs, PDDemont, EHDiallo, HFallon, DJGordon, LJGrandi, PHobbs, CIHooper-Greenhill, EJones, EJLaw, RPLe Gall, ALugo, DMichon, AMMitchell, DJPrinjha, RKSheppard, RJWatson, AJWatson, RJ GSK6853, a Chemical Probe for Inhibition of the BRPF1 Bromodomain. ACS Med Chem Lett7:552-7 (2016) 
 
Peregrin
Name:Peregrin
Type:PROTEIN
Mol. Mass.:137524.47
Organism:Homo sapiens (Human)
Description:ChEMBL_108054
Residue:1214
BDBM50189350
NameBDBM50189350
Synonyms:CHEMBL3828546
TypeSmall organic molecule
Emp. Form.C18H20N4O3
Mol. Mass.340.3764
SMILESCC(C)Oc1cc2n(C)c(=O)n(C)c2cc1NC(=O)c1ccncc1