Reaction Details
TargetBromodomain and PHD finger-containing protein 3
LigandBDBM50189403
Substrate/Competitorn/a
Meas. Tech.ChEMBL_1589342 (CHEMBL3830586)
IC50 15849±n/a nM
Citation Bamborough, PBarnett, HABecher, IBird, MJChung, CWCraggs, PDDemont, EHDiallo, HFallon, DJGordon, LJGrandi, PHobbs, CIHooper-Greenhill, EJones, EJLaw, RPLe Gall, ALugo, DMichon, AMMitchell, DJPrinjha, RKSheppard, RJWatson, AJWatson, RJ GSK6853, a Chemical Probe for Inhibition of the BRPF1 Bromodomain. ACS Med Chem Lett7:552-7 (2016) 
 
Bromodomain and PHD finger-containing protein 3
Name:Bromodomain and PHD finger-containing protein 3
Type:PROTEIN
Mol. Mass.:135743.95
Organism:Homo sapiens (Human)
Description:ChEMBL_108004
Residue:1205
BDBM50189403
NameBDBM50189403
Synonyms:CHEMBL3828191
TypeSmall organic molecule
Emp. Form.C22H27N5O3
Mol. Mass.409.4815
SMILESCOc1ccccc1C(=O)Nc1cc2n(C)c(=O)n(C)c2cc1N1CCNC[C@H]1C