Reaction Details
TargetCyclin-dependent kinase 8
LigandBDBM50189451
Substrate/Competitorn/a
Meas. Tech.ChEMBL_1589660 (CHEMBL3829689)
IC50 9.8±n/a nM
Citation Mallinger, ASchiemann, KRink, CSejberg, JHoney, MACzodrowski, PStubbs, MPoeschke, OBusch, MSchneider, RSchwarz, DMusil, DBurke, RUrbahns, KWorkman, PWienke, DClarke, PARaynaud, FIEccles, SAEsdar, CRohdich, FBlagg, J 2,8-Disubstituted-1,6-Naphthyridines and 4,6-Disubstituted-Isoquinolines with Potent, Selective Affinity for CDK8/19. ACS Med Chem Lett7:573-8 (2016) 
 
Cyclin-dependent kinase 8
Name:Cyclin-dependent kinase 8
Type:Serine/threonine-protein kinase
Mol. Mass.:53300.21
Organism:Homo sapiens (Human)
Description:P49336
Residue:464
BDBM50189451
NameBDBM50189451
Synonyms:CHEMBL3828286
TypeSmall organic molecule
Emp. Form.C23H21FN6O
Mol. Mass.416.4508
SMILESCn1cc(cn1)-c1ccc(cc1)-c1cnc(N)c2ccc(nc12)C(=O)N1CC(C)(F)C1