Reaction Details
TargetCyclin-C
LigandBDBM50189413
Substrate/Competitorn/a
Meas. Tech.ChEMBL_1589659 (CHEMBL3829688)
IC50 5.4±n/a nM
Citation Mallinger, ASchiemann, KRink, CSejberg, JHoney, MACzodrowski, PStubbs, MPoeschke, OBusch, MSchneider, RSchwarz, DMusil, DBurke, RUrbahns, KWorkman, PWienke, DClarke, PARaynaud, FIEccles, SAEsdar, CRohdich, FBlagg, J 2,8-Disubstituted-1,6-Naphthyridines and 4,6-Disubstituted-Isoquinolines with Potent, Selective Affinity for CDK8/19. ACS Med Chem Lett7:573-8 (2016) 
 
Cyclin-C
Name:Cyclin-C
Type:PROTEIN
Mol. Mass.:33244.88
Organism:Homo sapiens (Human)
Description:ChEMBL_107900
Residue:283
BDBM50189413
NameBDBM50189413
Synonyms:CHEMBL3827774
TypeSmall organic molecule
Emp. Form.C18H15N5O
Mol. Mass.317.3446
SMILESCNC(=O)c1ccc2cncc(-c3ccc4n(C)ncc4c3)c2n1