Reaction Details
TargetVascular endothelial growth factor receptor 2
LigandBDBM50189786
Substrate/Competitorn/a
Meas. Tech.ChEMBL_1590269 (CHEMBL3830047)
IC50 13±n/a nM
Citation Yan, WWang, XDai, YZhao, BYang, XFan, JGao, YMeng, FWang, YLuo, CAi, JGeng, MDuan, W Discovery of 3-(5'-Substituted)-Benzimidazole-5-(1-(3,5-dichloropyridin-4-yl)ethoxy)-1H-indazoles as Potent Fibroblast Growth Factor Receptor Inhibitors: Design, Synthesis, and Biological Evaluation. J Med Chem59:6690-708 (2016) 
 
Vascular endothelial growth factor receptor 2
Name:Vascular endothelial growth factor receptor 2
Type:Receptor Tyrosine Kinase
Mol. Mass.:151510.97
Organism:Homo sapiens (Human)
Description:P35968
Residue:1356
BDBM50189786
NameBDBM50189786
Synonyms:CHEMBL3827180
TypeSmall organic molecule
Emp. Form.C23H19Cl2N5O2
Mol. Mass.468.335
SMILESCC(Oc1ccc2[nH]nc(-c3nc4cc(CCO)ccc4[nH]3)c2c1)c1c(Cl)cncc1Cl