Reaction Details
TargetProto-oncogene tyrosine-protein kinase receptor Ret
LigandBDBM50189787
Substrate/Competitorn/a
Meas. Tech.ChEMBL_1590290 (CHEMBL3830182)
IC50>100±n/a nM
Citation Yan, WWang, XDai, YZhao, BYang, XFan, JGao, YMeng, FWang, YLuo, CAi, JGeng, MDuan, W Discovery of 3-(5'-Substituted)-Benzimidazole-5-(1-(3,5-dichloropyridin-4-yl)ethoxy)-1H-indazoles as Potent Fibroblast Growth Factor Receptor Inhibitors: Design, Synthesis, and Biological Evaluation. J Med Chem59:6690-708 (2016) 
 
Proto-oncogene tyrosine-protein kinase receptor Ret
Name:Proto-oncogene tyrosine-protein kinase receptor Ret
Type:Protein
Mol. Mass.:124318.29
Organism:Homo sapiens (Human)
Description:P07949
Residue:1114
BDBM50189787
NameBDBM50189787
Synonyms:CHEMBL3827178
TypeSmall organic molecule
Emp. Form.C26H25Cl2N7O
Mol. Mass.522.429
SMILESC[C@@H](Oc1ccc2[nH]nc(-c3nc4cc(ccc4[nH]3)N3CCN(C)CC3)c2c1)c1c(Cl)cncc1Cl