Reaction Details
TargetFibroblast growth factor receptor 4
LigandBDBM50065454
Substrate/Competitorn/a
Meas. Tech.ChEMBL_1590308 (CHEMBL3830200)
IC50 165±n/a nM
Citation Yan, WWang, XDai, YZhao, BYang, XFan, JGao, YMeng, FWang, YLuo, CAi, JGeng, MDuan, W Discovery of 3-(5'-Substituted)-Benzimidazole-5-(1-(3,5-dichloropyridin-4-yl)ethoxy)-1H-indazoles as Potent Fibroblast Growth Factor Receptor Inhibitors: Design, Synthesis, and Biological Evaluation. J Med Chem59:6690-708 (2016) 
 
Fibroblast growth factor receptor 4
Name:Fibroblast growth factor receptor 4
Type:Protein
Mol. Mass.:87957.45
Organism:Homo sapiens (Human)
Description:P22455
Residue:802
BDBM50065454
NameBDBM50065454
Synonyms:CHEBI:63453 | CHEMBL3348846
TypeSmall organic molecule
Emp. Form.C26H33N5O3
Mol. Mass.463.5719
SMILESCOc1cc(CCc2cc(NC(=O)c3ccc(cc3)N3C[C@H](C)N[C@H](C)C3)n[nH]2)cc(OC)c1