Reaction Details
TargetFibroblast growth factor receptor 1
LigandBDBM50189869
Substrate/Competitorn/a
Meas. Tech.ChEMBL_1590266 (CHEMBL3830044)
IC50 3.6±n/a nM
Citation Yan, WWang, XDai, YZhao, BYang, XFan, JGao, YMeng, FWang, YLuo, CAi, JGeng, MDuan, W Discovery of 3-(5'-Substituted)-Benzimidazole-5-(1-(3,5-dichloropyridin-4-yl)ethoxy)-1H-indazoles as Potent Fibroblast Growth Factor Receptor Inhibitors: Design, Synthesis, and Biological Evaluation. J Med Chem59:6690-708 (2016) 
 
Fibroblast growth factor receptor 1
Name:Fibroblast growth factor receptor 1
Type:Receptor
Mol. Mass.:91861.70
Organism:Homo sapiens (Human)
Description:P11362
Residue:822
BDBM50189869
NameBDBM50189869
Synonyms:CHEMBL3827706
TypeSmall organic molecule
Emp. Form.C27H27Cl2N7O
Mol. Mass.536.456
SMILESCCN1CCN(CC1)c1ccc2[nH]c(nc2c1)-c1n[nH]c2ccc(OC(C)c3c(Cl)cncc3Cl)cc12