Reaction Details
TargetApoptosis regulator Bcl-2
LigandBDBM23223
Substrate/Competitorn/a
Meas. Tech.ChEMBL_1590435 (CHEMBL3830805)
Ki 440±n/a nM
Citation Yang, CChen, HLu, SZhang, MTian, WWang, MZhang, LSong, YShen, AZhou, YZhu, JZheng, C Structural modification of luteolin from Flos Chrysanthemi leads to increased tumor cell growth inhibitory activity. Bioorg Med Chem Lett26:3464-7 (2016) 
 
Apoptosis regulator Bcl-2
Name:Apoptosis regulator Bcl-2
Type:Homodimer or heterodimer
Mol. Mass.:26269.11
Organism:Homo sapiens (Human)
Description:P10415
Residue:239
BDBM23223
NameBDBM23223
Synonyms:7-[8-formyl-1,6,7-trihydroxy-3-methyl-5-(propan-2-yl)naphthalen-2-yl]-2,3,8-trihydroxy-6-methyl-4-(propan-2-yl)naphthalene-1-carbaldehyde Gossypol Gossypol, 4 Tash 1 cid_3503
TypeSmall organic molecule
Emp. Form.C30H30O8
Mol. Mass.518.5544
SMILESCC(C)c1c(O)c(O)c(C=O)c2c(O)c(c(C)cc12)-c1c(C)cc2c(C(C)C)c(O)c(O)c(C=O)c2c1O