Reaction Details
TargetCyclin-T1/Cyclin-dependent kinase 9
LigandBDBM50189885
Substrate/Competitorn/a
Meas. Tech.ChEMBL_1590839 (CHEMBL3830223)
IC50 300±n/a nM
Citation Kumar, VGuru, SKJain, SKJoshi, PGandhi, SGBharate, SBBhushan, SBharate, SSVishwakarma, RA A chromatography-free isolation of rohitukine from leaves of Dysoxylum binectariferum: Evaluation for in vitro cytotoxicity, Cdk inhibition and physicochemical properties. Bioorg Med Chem Lett26:3457-63 (2016) 
 
Cyclin-T1/Cyclin-dependent kinase 9
Name:Cyclin-T1/Cyclin-dependent kinase 9
Type:Protein Complex
Mol. Mass.:n/a
Description:n/a
Components:This complex has 2 components.
Component 1
Name:Cyclin-T1
Synonyms:CCNT1 CycT Cyclin T Cyclin-T
Type:Enzyme Subunit
Mol. Mass.:80712.40
Organism:Homo sapiens (Human)
Description:n/a
Residue:726
Component 2
Name:Cyclin-dependent kinase 9
Synonyms:C-2K CDK9 Cell division cycle 2-like protein kinase 4 Cyclin-Dependent Kinase 9 (CDK9) Serine/threonine-protein kinase PITALRE Tat-associated kinase complex catalytic subunit
Type:Enzyme Subunit
Mol. Mass.:42789.13
Organism:Homo sapiens (Human)
Description:n/a
Residue:372
BDBM50189885
NameBDBM50189885
Synonyms:Rohitukine
TypeSmall organic molecule
Emp. Form.C16H19NO5
Mol. Mass.305.3258
SMILESCN1CC[C@@H]([C@H](O)C1)c1c(O)cc(O)c2c1oc(C)cc2=O