Reaction Details
TargetHistone deacetylase 1
LigandBDBM50189903
Substrate/Competitorn/a
Meas. Tech.ChEMBL_1590996 (CHEMBL3830868)
Ki 84±n/a nM
Citation Wagner, FFWeïwer, MSteinbacher, SSchomburg, AReinemer, PGale, JPCampbell, AJFisher, SLZhao, WNReis, SAHennig, KMThomas, MMüller, PJefson, MRFass, DMHaggarty, SJZhang, YLHolson, EB Kinetic and structural insights into the binding of histone deacetylase 1 and 2 (HDAC1, 2) inhibitors. Bioorg Med Chem24:4008-4015 (2016) 
 
Histone deacetylase 1
Name:Histone deacetylase 1
Type:Enzyme
Mol. Mass.:55090.27
Organism:Homo sapiens (Human)
Description:Q13547
Residue:482
BDBM50189903
NameBDBM50189903
Synonyms:CHEMBL3828396 | US11572368, Compound 54
TypeSmall organic molecule
Emp. Form.C18H19FN2O2
Mol. Mass.314.3541
SMILESNc1ccc(cc1NC(=O)C1CCOCC1)-c1ccc(F)cc1