Reaction Details
TargetHistone deacetylase 2
LigandBDBM50189911
Substrate/Competitorn/a
Meas. Tech.ChEMBL_1591001 (CHEMBL3830979)
Ki 519±n/a nM
Citation Wagner, FFWeïwer, MSteinbacher, SSchomburg, AReinemer, PGale, JPCampbell, AJFisher, SLZhao, WNReis, SAHennig, KMThomas, MMüller, PJefson, MRFass, DMHaggarty, SJZhang, YLHolson, EB Kinetic and structural insights into the binding of histone deacetylase 1 and 2 (HDAC1, 2) inhibitors. Bioorg Med Chem24:4008-4015 (2016) 
 
Histone deacetylase 2
Name:Histone deacetylase 2
Type:Chromatin regulator; hydrolase; repressor
Mol. Mass.:55356.54
Organism:Homo sapiens (Human)
Description:Q92769
Residue:488
BDBM50189911
NameBDBM50189911
Synonyms:CHEMBL3827611
TypeSmall organic molecule
Emp. Form.C20H21FN2O2
Mol. Mass.340.3913
SMILES[H][C@]12CC[C@]([H])(C[C@H](C1)C(=O)Nc1cc(ccc1N)-c1ccc(F)cc1)O2