Reaction Details
TargetEndoplasmic reticulum aminopeptidase 2
LigandBDBM50170873
Substrate/Competitorn/a
Meas. Tech.ChEBML_1591204
Ki 11500±n/a nM
Citation Weglarz-Tomczak, EVassiliou, SMucha, A Discovery of potent and selective inhibitors of human aminopeptidases ERAP1 and ERAP2 by screening libraries of phosphorus-containing amino acid and dipeptide analogues. Bioorg Med Chem Lett26:4122-6 (2016) 
 
Endoplasmic reticulum aminopeptidase 2
Name:Endoplasmic reticulum aminopeptidase 2
Type:PROTEIN
Mol. Mass.:110463.90
Organism:Homo sapiens (Human)
Description:ChEMBL_1473169
Residue:960
BDBM50170873
NameBDBM50170873
Synonyms:CHEMBL3805193
TypeSmall organic molecule
Emp. Form.C13H23N2O3P
Mol. Mass.286.3071
SMILESCC(C)(C)c1ccc(CNCC(N)P(O)(O)=O)cc1