Reaction Details
TargetEndoplasmic reticulum aminopeptidase 2
LigandBDBM50190113
Substrate/Competitorn/a
Meas. Tech.ChEBML_1591204
Ki 65200±n/a nM
Citation Weglarz-Tomczak, EVassiliou, SMucha, A Discovery of potent and selective inhibitors of human aminopeptidases ERAP1 and ERAP2 by screening libraries of phosphorus-containing amino acid and dipeptide analogues. Bioorg Med Chem Lett26:4122-6 (2016) 
 
Endoplasmic reticulum aminopeptidase 2
Name:Endoplasmic reticulum aminopeptidase 2
Type:PROTEIN
Mol. Mass.:110463.90
Organism:Homo sapiens (Human)
Description:ChEMBL_1473169
Residue:960
BDBM50190113
NameBDBM50190113
Synonyms:CHEMBL3828715
TypeSmall organic molecule
Emp. Form.C19H26N3O4P
Mol. Mass.391.4012
SMILESNCc1ccc(CC(CP(O)(=O)C(N)CCc2ccncc2)C(O)=O)cc1