Reaction Details
TargetEndoplasmic reticulum aminopeptidase 1
LigandBDBM50025048
Substrate/Competitorn/a
Meas. Tech.ChEBML_1591201
Ki 5550±n/a nM
Citation Weglarz-Tomczak, EVassiliou, SMucha, A Discovery of potent and selective inhibitors of human aminopeptidases ERAP1 and ERAP2 by screening libraries of phosphorus-containing amino acid and dipeptide analogues. Bioorg Med Chem Lett26:4122-6 (2016) 
 
Endoplasmic reticulum aminopeptidase 1
Name:Endoplasmic reticulum aminopeptidase 1
Type:PROTEIN
Mol. Mass.:107232.03
Organism:Homo sapiens (Human)
Description:ChEMBL_1473167
Residue:941
BDBM50025048
NameBDBM50025048
Synonyms:CHEMBL3355099
TypeSmall organic molecule
Emp. Form.C9H14NO3P
Mol. Mass.215.1861
SMILESN[C@@H](CCc1ccccc1)P(O)(O)=O