Reaction Details
TargetEndoplasmic reticulum aminopeptidase 1
LigandBDBM50190111
Substrate/Competitorn/a
Meas. Tech.ChEBML_1591201
Ki 19100±n/a nM
Citation Weglarz-Tomczak, EVassiliou, SMucha, A Discovery of potent and selective inhibitors of human aminopeptidases ERAP1 and ERAP2 by screening libraries of phosphorus-containing amino acid and dipeptide analogues. Bioorg Med Chem Lett26:4122-6 (2016) 
 
Endoplasmic reticulum aminopeptidase 1
Name:Endoplasmic reticulum aminopeptidase 1
Type:PROTEIN
Mol. Mass.:107232.03
Organism:Homo sapiens (Human)
Description:ChEMBL_1473167
Residue:941
BDBM50190111
NameBDBM50190111
Synonyms:CHEMBL327844
TypeSmall organic molecule
Emp. Form.C19H24NO4P
Mol. Mass.361.3719
SMILESNC(CCc1ccccc1)P(O)(=O)CC(Cc1ccccc1)C(O)=O