Reaction Details
TargetEndoplasmic reticulum aminopeptidase 2
LigandBDBM50170879
Substrate/Competitorn/a
Meas. Tech.ChEBML_1591204
Ki 3020±n/a nM
Citation Weglarz-Tomczak, EVassiliou, SMucha, A Discovery of potent and selective inhibitors of human aminopeptidases ERAP1 and ERAP2 by screening libraries of phosphorus-containing amino acid and dipeptide analogues. Bioorg Med Chem Lett26:4122-6 (2016) 
 
Endoplasmic reticulum aminopeptidase 2
Name:Endoplasmic reticulum aminopeptidase 2
Type:PROTEIN
Mol. Mass.:110463.90
Organism:Homo sapiens (Human)
Description:ChEMBL_1473169
Residue:960
BDBM50170879
NameBDBM50170879
Synonyms:CHEMBL3805472
TypeSmall organic molecule
Emp. Form.C12H19N2O4P
Mol. Mass.286.264
SMILESNCC(N)P(O)(=O)CC(Cc1ccccc1)C(O)=O