Reaction Details
TargetEndoplasmic reticulum aminopeptidase 1
LigandBDBM50170899
Substrate/Competitorn/a
Meas. Tech.ChEBML_1591201
Ki>250000±n/a nM
Citation Weglarz-Tomczak, EVassiliou, SMucha, A Discovery of potent and selective inhibitors of human aminopeptidases ERAP1 and ERAP2 by screening libraries of phosphorus-containing amino acid and dipeptide analogues. Bioorg Med Chem Lett26:4122-6 (2016) 
 
Endoplasmic reticulum aminopeptidase 1
Name:Endoplasmic reticulum aminopeptidase 1
Type:PROTEIN
Mol. Mass.:107232.03
Organism:Homo sapiens (Human)
Description:ChEMBL_1473167
Residue:941
BDBM50170899
NameBDBM50170899
Synonyms:CHEMBL3806100
TypeSmall organic molecule
Emp. Form.C4H14N3O3P
Mol. Mass.183.146
SMILESNCCNCC(N)P(O)(O)=O