Reaction Details
TargetCarbonic anhydrase 12
LigandBDBM50190147
Substrate/Competitorn/a
Meas. Tech.ChEBML_1591368
Ki 0.540000±n/a nM
Citation Bozdag, MAlafeefy, AMCarta, FCeruso, MAl-Tamimi, ASAl-Kahtani, AAAlasmary, FASSupuran, CT Synthesis 4-[2-(2-mercapto-4-oxo-4H-quinazolin-3-yl)-ethyl]-benzenesulfonamides with subnanomolar carbonic anhydrase II and XII inhibitory properties. Bioorg Med Chem24:4100-4107 (2016) 
 
Carbonic anhydrase 12
Name:Carbonic anhydrase 12
Type:Enzyme
Mol. Mass.:39456.00
Organism:Homo sapiens (Human)
Description:Catalytic domain of human cloned isozyme was used in the assay
Residue:354
BDBM50190147
NameBDBM50190147
Synonyms:CHEMBL3828207
TypeSmall organic molecule
Emp. Form.C16H14ClN3O3S2
Mol. Mass.395.884
SMILESNS(=O)(=O)c1ccc(CCn2c(S)nc3ccc(Cl)cc3c2=O)cc1