Reaction Details
TargetCarbonic anhydrase 2
LigandBDBM50190134
Substrate/Competitorn/a
Meas. Tech.ChEBML_1591367
Ki 0.620000±n/a nM
Citation Bozdag, MAlafeefy, AMCarta, FCeruso, MAl-Tamimi, ASAl-Kahtani, AAAlasmary, FASSupuran, CT Synthesis 4-[2-(2-mercapto-4-oxo-4H-quinazolin-3-yl)-ethyl]-benzenesulfonamides with subnanomolar carbonic anhydrase II and XII inhibitory properties. Bioorg Med Chem24:4100-4107 (2016) 
 
Carbonic anhydrase 2
Name:Carbonic anhydrase 2
Type:Enzyme
Mol. Mass.:29250.71
Organism:Homo sapiens (Human)
Description:P00918
Residue:260
BDBM50190134
NameBDBM50190134
Synonyms:CHEMBL1433252
TypeSmall organic molecule
Emp. Form.C16H15N3O3S2
Mol. Mass.361.439
SMILESNS(=O)(=O)c1ccc(CCn2c(=S)[nH]c3ccccc3c2=O)cc1