Reaction Details
TargetCarbonic anhydrase 1
LigandBDBM50190139
Substrate/Competitorn/a
Meas. Tech.ChEMBL_1591366 (CHEMBL3830275)
Ki 2954±n/a nM
Citation Bozdag, MAlafeefy, AMCarta, FCeruso, MAl-Tamimi, ASAl-Kahtani, AAAlasmary, FASSupuran, CT Synthesis 4-[2-(2-mercapto-4-oxo-4H-quinazolin-3-yl)-ethyl]-benzenesulfonamides with subnanomolar carbonic anhydrase II and XII inhibitory properties. Bioorg Med Chem24:4100-4107 (2016) 
 
Carbonic anhydrase 1
Name:Carbonic anhydrase 1
Type:Enzyme
Mol. Mass.:28873.37
Organism:Homo sapiens (Human)
Description:P00915
Residue:261
BDBM50190139
NameBDBM50190139
Synonyms:CHEMBL3828646
TypeSmall organic molecule
Emp. Form.C17H17N3O3S2
Mol. Mass.375.465
SMILESCc1cccc2c1nc(S)n(CCc1ccc(cc1)S(N)(=O)=O)c2=O