Reaction Details
TargetCarbonic anhydrase 12
LigandBDBM50190143
Substrate/Competitorn/a
Meas. Tech.ChEMBL_1591368 (CHEMBL3830277)
Ki 0.540000±n/a nM
Citation Bozdag, MAlafeefy, AMCarta, FCeruso, MAl-Tamimi, ASAl-Kahtani, AAAlasmary, FASSupuran, CT Synthesis 4-[2-(2-mercapto-4-oxo-4H-quinazolin-3-yl)-ethyl]-benzenesulfonamides with subnanomolar carbonic anhydrase II and XII inhibitory properties. Bioorg Med Chem24:4100-4107 (2016) 
 
Carbonic anhydrase 12
Name:Carbonic anhydrase 12
Type:Enzyme
Mol. Mass.:39456.00
Organism:Homo sapiens (Human)
Description:Catalytic domain of human cloned isozyme was used in the assay
Residue:354
BDBM50190143
NameBDBM50190143
Synonyms:CHEMBL3827651
TypeSmall organic molecule
Emp. Form.C17H17N3O4S2
Mol. Mass.391.465
SMILESCOc1ccc2nc(S)n(CCc3ccc(cc3)S(N)(=O)=O)c(=O)c2c1