Reaction Details
TargetCarbonic anhydrase 1
LigandBDBM50190137
Substrate/Competitorn/a
Meas. Tech.ChEMBL_1591366 (CHEMBL3830275)
Ki 268±n/a nM
Citation Bozdag, MAlafeefy, AMCarta, FCeruso, MAl-Tamimi, ASAl-Kahtani, AAAlasmary, FASSupuran, CT Synthesis 4-[2-(2-mercapto-4-oxo-4H-quinazolin-3-yl)-ethyl]-benzenesulfonamides with subnanomolar carbonic anhydrase II and XII inhibitory properties. Bioorg Med Chem24:4100-4107 (2016) 
 
Carbonic anhydrase 1
Name:Carbonic anhydrase 1
Type:Enzyme
Mol. Mass.:28873.37
Organism:Homo sapiens (Human)
Description:P00915
Residue:261
BDBM50190137
NameBDBM50190137
Synonyms:CHEMBL3827090
TypeSmall organic molecule
Emp. Form.C19H21N3O6S2
Mol. Mass.451.517
SMILESCOc1cc2c(nc(S)n(CCc3ccc(cc3)S(N)(=O)=O)c2=O)c(OC)c1OC