Reaction Details
TargetDihydropteroate synthase
LigandBDBM50190580
Substrate/Competitorn/a
Meas. Tech.ChEMBL_1589224 (CHEMBL3830117)
IC50 19300±n/a nM
Citation Zhao, YShadrick, WRWallace, MJWu, YGriffith, ECQi, JYun, MKWhite, SWLee, RE Pterin-sulfa conjugates as dihydropteroate synthase inhibitors and antibacterial agents. Bioorg Med Chem Lett26:3950-4 (2016) 
 
Dihydropteroate synthase
Name:Dihydropteroate synthase
Synonyms:n/a
Type:PROTEIN
Mol. Mass.:30967.84
Organism:Bacillus anthracis
Description:ChEMBL_595739
Residue:280
BDBM50190580
NameBDBM50190580
Synonyms:CHEMBL3828019
TypeSmall organic molecule
Emp. Form.C17H15N9O3S
Mol. Mass.425.424
SMILESNc1nc2ncc(CNc3ccc(cc3)S(=O)(=O)Nc3ncccn3)nc2c(=O)[nH]1