Reaction Details
TargetDihydropteroate synthase
LigandBDBM50190582
Substrate/Competitorn/a
Meas. Tech.ChEMBL_1589225 (CHEMBL3830118)
IC50 1900±n/a nM
Citation Zhao, YShadrick, WRWallace, MJWu, YGriffith, ECQi, JYun, MKWhite, SWLee, RE Pterin-sulfa conjugates as dihydropteroate synthase inhibitors and antibacterial agents. Bioorg Med Chem Lett26:3950-4 (2016) 
 
Dihydropteroate synthase
Name:Dihydropteroate synthase
Synonyms:n/a
Type:PROTEIN
Mol. Mass.:30967.84
Organism:Bacillus anthracis
Description:ChEMBL_595739
Residue:280
BDBM50190582
NameBDBM50190582
Synonyms:CHEMBL3827911
TypeSmall organic molecule
Emp. Form.C19H19N9O5S
Mol. Mass.485.476
SMILESCOc1cc(NS(=O)(=O)c2ccc(NCc3cnc4nc(N)[nH]c(=O)c4n3)cc2)nc(OC)n1