Reaction Details
TargetDihydropteroate synthase
LigandBDBM50190584
Substrate/Competitorn/a
Meas. Tech.ChEMBL_1589225 (CHEMBL3830118)
IC50 11300±n/a nM
Citation Zhao, YShadrick, WRWallace, MJWu, YGriffith, ECQi, JYun, MKWhite, SWLee, RE Pterin-sulfa conjugates as dihydropteroate synthase inhibitors and antibacterial agents. Bioorg Med Chem Lett26:3950-4 (2016) 
 
Dihydropteroate synthase
Name:Dihydropteroate synthase
Synonyms:n/a
Type:PROTEIN
Mol. Mass.:30967.84
Organism:Bacillus anthracis
Description:ChEMBL_595739
Residue:280
BDBM50190584
NameBDBM50190584
Synonyms:CHEMBL3828105
TypeSmall organic molecule
Emp. Form.C19H17N7O3S
Mol. Mass.423.448
SMILESNc1ccc(cc1)S(=O)(=O)c1ccc(NCc2cnc3nc(N)[nH]c(=O)c3n2)cc1