Reaction Details
TargetKelch-like ECH-associated protein 1
LigandBDBM50190617
Substrate/Competitorn/a
Meas. Tech.ChEMBL_1589518 (CHEMBL3829092)
IC50 100±n/a nM
Citation Abdel-Magid, AF Therapeutic Potential for Modulation of Nrf2-Keap-1 Signaling Pathway as Treatment for Diabetes and Other Disorders. ACS Med Chem Lett7:660-1 (2016) 
 
Kelch-like ECH-associated protein 1
Name:Kelch-like ECH-associated protein 1
Type:PROTEIN
Mol. Mass.:69664.53
Organism:Homo sapiens (Human)
Description:ChEMBL_107924
Residue:624
BDBM50190617
NameBDBM50190617
Synonyms:CHEMBL3827626
TypeSmall organic molecule
Emp. Form.C25H28N2O4S
Mol. Mass.452.566
SMILESCc1cc(C)c(C)c(c1C)S(=O)(=O)Nc1ccc(N2CC[C@H](C2)C(O)=O)c2ccccc12