Reaction Details
TargetDihydrofolate reductase
LigandBDBM18069
Substrate/Competitorn/a
Meas. Tech.ChEMBL_1589519 (CHEMBL3829093)
Ki 3.4±n/a nM
Citation Scocchera, EReeve, SMKeshipeddy, SLombardo, MNHajian, BSochia, AEAlverson, JBPriestley, NDAnderson, ACWright, DL Charged Nonclassical Antifolates with Activity Against Gram-Positive and Gram-Negative Pathogens. ACS Med Chem Lett7:692-6 (2016) 
 
Dihydrofolate reductase
Name:Dihydrofolate reductase
Type:Enzyme
Mol. Mass.:18249.71
Organism:Staphylococcus aureus
Description:n/a
Residue:159
BDBM18069
NameBDBM18069
Synonyms:5-[(3,4,5-trimethoxyphenyl)methyl]pyrimidine-2,4-diamine TMP Trimethoprim (TMP) | US10870625, Compound TMP
TypeSmall organic molecule
Emp. Form.C14H18N4O3
Mol. Mass.290.3177
SMILESCOc1cc(Cc2cnc(N)nc2N)cc(OC)c1OC