Reaction Details
TargetDihydrofolate reductase
LigandBDBM50190620
Substrate/Competitorn/a
Meas. Tech.ChEMBL_1589520 (CHEMBL3829094)
Ki 5.7±n/a nM
Citation Scocchera, EReeve, SMKeshipeddy, SLombardo, MNHajian, BSochia, AEAlverson, JBPriestley, NDAnderson, ACWright, DL Charged Nonclassical Antifolates with Activity Against Gram-Positive and Gram-Negative Pathogens. ACS Med Chem Lett7:692-6 (2016) 
 
Dihydrofolate reductase
Name:Dihydrofolate reductase
Type:n/a
Mol. Mass.:17532.46
Organism:Escherichia coli
Description:n/a
Residue:157
BDBM50190620
NameBDBM50190620
Synonyms:CHEMBL3828724
TypeSmall organic molecule
Emp. Form.C25H23F3N4O5
Mol. Mass.516.4691
SMILESOC(=O)C(F)(F)F.CCc1nc(N)nc(N)c1C#CCc1cc(ccc1OC)-c1cccc(c1)C(O)=O