Reaction Details
TargetDihydrofolate reductase
LigandBDBM210931
Substrate/Competitorn/a
Meas. Tech.ChEMBL_1589521 (CHEMBL3829095)
Ki 159±n/a nM
Citation Scocchera, EReeve, SMKeshipeddy, SLombardo, MNHajian, BSochia, AEAlverson, JBPriestley, NDAnderson, ACWright, DL Charged Nonclassical Antifolates with Activity Against Gram-Positive and Gram-Negative Pathogens. ACS Med Chem Lett7:692-6 (2016) 
 
Dihydrofolate reductase
Name:Dihydrofolate reductase
Type:Enzyme
Mol. Mass.:21453.99
Organism:Homo sapiens (Human)
Description:Recombinant human DHFR.
Residue:187
BDBM210931
NameBDBM210931
Synonyms:UCP1175
TypeSmall organic molecule
Emp. Form.C23H22N4O3
Mol. Mass.402.4458
SMILESCCc1nc(N)nc(N)c1C#CCc1cc(OC)cc(c1)-c1ccc(cc1)C(O)=O