Reaction Details
TargetLarge neutral amino acids transporter small subunit 3
LigandBDBM50190653
Substrate/Competitorn/a
Meas. Tech.ChEMBL_1612369 (CHEMBL3854169)
IC50 15500±n/a nM
Citation Wibowo, MLevrier, CSadowski, MCNelson, CCWang, QHolst, JHealy, PCHofmann, ADavis, RA Bioactive Dihydro-ß-agarofuran Sesquiterpenoids from the Australian Rainforest Plant Maytenus bilocularis. J Nat Prod79:1445-53 (2016) 
 
Large neutral amino acids transporter small subunit 3
Name:Large neutral amino acids transporter small subunit 3
Type:PROTEIN
Mol. Mass.:61481.76
Organism:Homo sapiens (Human)
Description:ChEMBL_100162
Residue:559
BDBM50190653
NameBDBM50190653
Synonyms:CHEMBL3959689
TypeSmall organic molecule
Emp. Form.C28H36O9
Mol. Mass.516.58
SMILES[H][C@@]12[C@@H](OC(C)=O)[C@]3(OC1(C)C)[C@H](C)CC[C@H](OC(C)=O)[C@@]3(C)[C@H](OC(=O)c1ccccc1)[C@@H]2OC(C)=O