Reaction Details
TargetAldo-keto reductase family 1 member B1
LigandBDBM11318
Substrate/Competitorn/a
Meas. Tech.ChEMBL_1612421 (CHEMBL3854221)
IC50 2690±n/a nM
Citation Chang, KCLi, LSanborn, TMShieh, BLenhart, PAmmar, DLaBarbera, DVPetrash, JM Characterization of Emodin as a Therapeutic Agent for Diabetic Cataract. J Nat Prod79:1439-44 (2016) 
 
Aldo-keto reductase family 1 member B1
Name:Aldo-keto reductase family 1 member B1
Type:Protein
Mol. Mass.:35855.50
Organism:Homo sapiens (Human)
Description:P15121. 4LAU; 2IKI; 4LB4; 2FZD; 2FZ8; 1US0
Residue:316
BDBM11318
NameBDBM11318
Synonyms:1,3,8-trihydroxy-6-methyl-9,10-dihydroanthracene-9,10-dione CHEMBL289277 US20230364057, Compound 242 | med.21724, Compound 24
TypeSmall organic molecule
Emp. Form.C15H10O5
Mol. Mass.270.2369
SMILESCc1cc(O)c2C(=O)c3c(O)cc(O)cc3C(=O)c2c1