Reaction Details
TargetHepatocyte growth factor receptor
LigandBDBM50190915
Substrate/Competitorn/a
Meas. Tech.ChEMBL_1612521 (CHEMBL3854321)
IC50 17±n/a nM
Citation Zhao, SZhang, YZhou, HXi, SZou, BBao, GWang, LWang, JZeng, TGong, PZhai, X Synthesis and biological evaluation of 4-(2-fluorophenoxy)-3,3'-bipyridine derivatives as potential c-met inhibitors. Eur J Med Chem120:37-50 (2016) 
 
Hepatocyte growth factor receptor
Name:Hepatocyte growth factor receptor
Type:Protein
Mol. Mass.:155559.73
Organism:Homo sapiens (Human)
Description:P08581
Residue:1390
BDBM50190915
NameBDBM50190915
Synonyms:CHEMBL3983663
TypeSmall organic molecule
Emp. Form.C31H19F4N5O4S
Mol. Mass.633.572
SMILESFc1cc(NC(=O)C2=NN(c3ccccc3C(F)(F)F)c3ccccc3S2(=O)=O)ccc1Oc1ccncc1-c1cccnc1