Reaction Details
Target3-hydroxy-3-methylglutaryl-coenzyme A reductase
LigandBDBM20688
Substrate/Competitorn/a
Meas. Tech.ChEMBL_1612744 (CHEMBL3854544)
IC50 400±n/a nM
Citation Phainuphong, PRukachaisirikul, VSaithong, SPhongpaichit, SBowornwiriyapan, KMuanprasat, CSrimaroeng, CDuangjai, ASakayaroj, J Lovastatin Analogues from the Soil-Derived Fungus Aspergillus sclerotiorum PSU-RSPG178. J Nat Prod79:1500-7 (2016) 
 
3-hydroxy-3-methylglutaryl-coenzyme A reductase
Name:3-hydroxy-3-methylglutaryl-coenzyme A reductase
Type:Enzyme
Mol. Mass.:97477.10
Organism:Homo sapiens (Human)
Description:P04035
Residue:888
BDBM20688
NameBDBM20688
Synonyms:(3R,5R)-7-[(1S,2S,6S,8S,8aR)-6-hydroxy-2-methyl-8-{[(2S)-2-methylbutanoyl]oxy}-1,2,6,7,8,8a-hexahydronaphthalen-1-yl]-3,5-dihydroxyheptanoic acid Pravastatin
TypeSmall organic molecule
Emp. Form.C23H36O7
Mol. Mass.424.5277
SMILES[H][C@]12[C@H](C[C@H](O)C=C1C=C[C@H](C)[C@@H]2CC[C@@H](O)C[C@@H](O)CC(O)=O)OC(=O)[C@@H](C)CC