Reaction Details
TargetIron-starvation protein PigA
LigandBDBM50191279
Substrate/Competitorn/a
Meas. Tech.ChEMBL_1612785 (CHEMBL3854585)
Kd 12000±n/a nM
Citation Heinzl, GAHuang, WYu, WGiardina, BJZhou, YMacKerell, ADWilks, AXue, F Iminoguanidines as Allosteric Inhibitors of the Iron-Regulated Heme Oxygenase (HemO) of Pseudomonas aeruginosa. J Med Chem59:6929-42 (2016) 
 
Iron-starvation protein PigA
Name:Iron-starvation protein PigA
Type:PROTEIN
Mol. Mass.:21946.19
Organism:Pseudomonas aeruginosa
Description:ChEMBL_444781
Residue:198
BDBM50191279
NameBDBM50191279
Synonyms:CHEMBL3969135
TypeSmall organic molecule
Emp. Form.C8H10ClFN4
Mol. Mass.216.643
SMILESCl.[#7]\[#6](-[#7])=[#7]\[#7]=[#6]\c1cccc(F)c1