Reaction Details
TargetIron-starvation protein PigA
LigandBDBM50191282
Substrate/Competitorn/a
Meas. Tech.ChEMBL_1612785 (CHEMBL3854585)
Kd 6700±n/a nM
Citation Heinzl, GAHuang, WYu, WGiardina, BJZhou, YMacKerell, ADWilks, AXue, F Iminoguanidines as Allosteric Inhibitors of the Iron-Regulated Heme Oxygenase (HemO) of Pseudomonas aeruginosa. J Med Chem59:6929-42 (2016) 
 
Iron-starvation protein PigA
Name:Iron-starvation protein PigA
Type:PROTEIN
Mol. Mass.:21946.19
Organism:Pseudomonas aeruginosa
Description:ChEMBL_444781
Residue:198
BDBM50191282
NameBDBM50191282
Synonyms:CHEMBL3920262
TypeSmall organic molecule
Emp. Form.C14H15ClN4
Mol. Mass.274.749
SMILESCl.[#7]\[#6](-[#7])=[#7]\[#7]=[#6]\c1ccc(cc1)-c1ccccc1