Reaction Details
TargetIron-starvation protein PigA
LigandBDBM50191285
Substrate/Competitorn/a
Meas. Tech.ChEMBL_1612785 (CHEMBL3854585)
Kd 9200±n/a nM
Citation Heinzl, GAHuang, WYu, WGiardina, BJZhou, YMacKerell, ADWilks, AXue, F Iminoguanidines as Allosteric Inhibitors of the Iron-Regulated Heme Oxygenase (HemO) of Pseudomonas aeruginosa. J Med Chem59:6929-42 (2016) 
 
Iron-starvation protein PigA
Name:Iron-starvation protein PigA
Type:PROTEIN
Mol. Mass.:21946.19
Organism:Pseudomonas aeruginosa
Description:ChEMBL_444781
Residue:198
BDBM50191285
NameBDBM50191285
Synonyms:CHEMBL105616
TypeSmall organic molecule
Emp. Form.C8H11ClN4O
Mol. Mass.214.652
SMILESCl.NC(=N)N\N=C\c1ccccc1O