Reaction Details
TargetIron-starvation protein PigA
LigandBDBM50191299
Substrate/Competitorn/a
Meas. Tech.ChEMBL_1612785 (CHEMBL3854585)
Kd 14000±n/a nM
Citation Heinzl, GAHuang, WYu, WGiardina, BJZhou, YMacKerell, ADWilks, AXue, F Iminoguanidines as Allosteric Inhibitors of the Iron-Regulated Heme Oxygenase (HemO) of Pseudomonas aeruginosa. J Med Chem59:6929-42 (2016) 
 
Iron-starvation protein PigA
Name:Iron-starvation protein PigA
Type:PROTEIN
Mol. Mass.:21946.19
Organism:Pseudomonas aeruginosa
Description:ChEMBL_444781
Residue:198
BDBM50191299
NameBDBM50191299
Synonyms:Amino(2-(4-Fluorobenzylidene)Hydrazinyl)Methaniminium Chloride | CHEMBL2346941
TypeSmall organic molecule
Emp. Form.C8H10ClFN4
Mol. Mass.216.643
SMILESCl.NC(=N)N\N=C\c1ccc(F)cc1