Reaction Details
TargetIron-starvation protein PigA
LigandBDBM50191300
Substrate/Competitorn/a
Meas. Tech.ChEMBL_1612785 (CHEMBL3854585)
Kd 8800±n/a nM
Citation Heinzl, GAHuang, WYu, WGiardina, BJZhou, YMacKerell, ADWilks, AXue, F Iminoguanidines as Allosteric Inhibitors of the Iron-Regulated Heme Oxygenase (HemO) of Pseudomonas aeruginosa. J Med Chem59:6929-42 (2016) 
 
Iron-starvation protein PigA
Name:Iron-starvation protein PigA
Type:PROTEIN
Mol. Mass.:21946.19
Organism:Pseudomonas aeruginosa
Description:ChEMBL_444781
Residue:198
BDBM50191300
NameBDBM50191300
Synonyms:Amino(2-(4-(Dimethylamino)Benzylidene)Hydrazinyl)Methaniminium Chloride | CHEMBL105167
TypeSmall organic molecule
Emp. Form.C10H16ClN5
Mol. Mass.241.721
SMILESCl.CN(C)c1ccc(\C=N\NC(N)=N)cc1