Reaction Details
TargetIron-starvation protein PigA
LigandBDBM50191308
Substrate/Competitorn/a
Meas. Tech.ChEMBL_1612785 (CHEMBL3854585)
Kd 11000±n/a nM
Citation Heinzl, GAHuang, WYu, WGiardina, BJZhou, YMacKerell, ADWilks, AXue, F Iminoguanidines as Allosteric Inhibitors of the Iron-Regulated Heme Oxygenase (HemO) of Pseudomonas aeruginosa. J Med Chem59:6929-42 (2016) 
 
Iron-starvation protein PigA
Name:Iron-starvation protein PigA
Type:PROTEIN
Mol. Mass.:21946.19
Organism:Pseudomonas aeruginosa
Description:ChEMBL_444781
Residue:198
BDBM50191308
NameBDBM50191308
Synonyms:Amino(2-(2-Chlorobenzylidene)Hydrazinyl)Methaniminium Chloride | CHEMBL2346945
TypeSmall organic molecule
Emp. Form.C8H10Cl2N4
Mol. Mass.233.098
SMILESCl.NC(=N)N\N=C\c1ccccc1Cl