Reaction Details
TargetBeta-adrenergic receptor kinase 2
LigandBDBM50191326
Substrate/Competitorn/a
Meas. Tech.ChEMBL_1612836 (CHEMBL3854636)
IC50 22600±n/a nM
Citation Guccione, MEttari, RTaliani, SDa Settimo, FZappalą, MGrasso, S G-Protein-Coupled Receptor Kinase 2 (GRK2) Inhibitors: Current Trends and Future Perspectives. J Med Chem59:9277-9294 (2016) Beta-adrenergic receptor kinase 2
Name:Beta-adrenergic receptor kinase 2
Type:PROTEIN
Mol. Mass.:79815.63
Organism:Bos taurus
Description:ChEMBL_113448
Residue:688
BDBM50191326
NameBDBM50191326
Synonyms:CHEMBL3953837
TypeSmall organic molecule
Emp. Form.C112H178N28O34
Mol. Mass.2460.7789
SMILESCC[C@H](C)[C@H](NC(=O)[C@H](C)NC(=O)[C@@H](NC(=O)[C@@H](N)CCC(O)=O)[C@@H](C)O)C(=O)N[C@@H](C)C(=O)N[C@@H](CCCCN)C(=O)N[C@@H](Cc1ccccc1)C(=O)N[C@@H](CCC(O)=O)C(=O)N[C@@H](CCCNC(N)=N)C(=O)N[C@@H](CC(C)C)C(=O)N[C@@H](CCC(N)=O)C(=O)N[C@@H]([C@@H](C)O)C(=O)N[C@@H](C(C)C)C(=O)N[C@@H]([C@@H](C)O)C(=O)N[C@@H](CC(N)=O)C(=O)N[C@@H](Cc1ccc(O)cc1)C(=O)N[C@@H](Cc1ccccc1)C(=O)N[C@@H]([C@@H](C)CC)C(=O)N[C@@H]([C@@H](C)O)C(=O)N[C@@H](CO)C(=O)N[C@@H](CCCCN)C(O)=O