Reaction Details
TargetCoagulation factor X
LigandBDBM50191350
Substrate/Competitorn/a
Meas. Tech.ChEMBL_1612855 (CHEMBL3854655)
Ki 1000±n/a nM
Citation Zhang, XGlunz, PWJohnson, JAJiang, WJacutin-Porte, SLadziata, VZou, YPhillips, MSWurtz, NRParkhurst, BRendina, ARHarper, TMCheney, DLLuettgen, JMWong, PCSeiffert, DWexler, RRPriestley, ES Discovery of a Highly Potent, Selective, and Orally Bioavailable Macrocyclic Inhibitor of Blood Coagulation Factor VIIa-Tissue Factor Complex. J Med Chem59:7125-37 (2016) 
 
Coagulation factor X
Name:Coagulation factor X
Type:Enzyme
Mol. Mass.:54726.60
Organism:Homo sapiens (Human)
Description:n/a
Residue:488
BDBM50191350
NameBDBM50191350
Synonyms:CHEMBL3935309
TypeSmall organic molecule
Emp. Form.C31H30F3N5O4
Mol. Mass.593.5962
SMILESC[C@H]1COC(=O)Nc2ccc(OC(F)(F)F)c(CN(C)C(=O)[C@H](Nc3ccc4c(N)nccc4c3)c3ccc1c(C)c3)c2