Reaction Details
TargetCoagulation factor X
LigandBDBM189416
Substrate/Competitorn/a
Meas. Tech.ChEMBL_1612855 (CHEMBL3854655)
Ki 6200±n/a nM
Citation Zhang, XGlunz, PWJohnson, JAJiang, WJacutin-Porte, SLadziata, VZou, YPhillips, MSWurtz, NRParkhurst, BRendina, ARHarper, TMCheney, DLLuettgen, JMWong, PCSeiffert, DWexler, RRPriestley, ES Discovery of a Highly Potent, Selective, and Orally Bioavailable Macrocyclic Inhibitor of Blood Coagulation Factor VIIa-Tissue Factor Complex. J Med Chem59:7125-37 (2016) 
 
Coagulation factor X
Name:Coagulation factor X
Type:Enzyme
Mol. Mass.:54726.60
Organism:Homo sapiens (Human)
Description:n/a
Residue:488
BDBM189416
NameBDBM189416
Synonyms:US9174974, Example 1
TypeSmall organic molecule
Emp. Form.C33H36N6O4
Mol. Mass.580.6767
SMILESC[C@H]1COC(=O)Nc2ccc(C(=O)N(C)C)c(CN(C)C(=O)[C@H](Nc3ccc4c(N)nccc4c3)c3ccc1c(C)c3)c2