Reaction Details
TargetKallikrein-1
LigandBDBM50191344
Substrate/Competitorn/a
Meas. Tech.ChEMBL_1612859 (CHEMBL3854659)
Ki 200±n/a nM
Citation Zhang, XGlunz, PWJohnson, JAJiang, WJacutin-Porte, SLadziata, VZou, YPhillips, MSWurtz, NRParkhurst, BRendina, ARHarper, TMCheney, DLLuettgen, JMWong, PCSeiffert, DWexler, RRPriestley, ES Discovery of a Highly Potent, Selective, and Orally Bioavailable Macrocyclic Inhibitor of Blood Coagulation Factor VIIa-Tissue Factor Complex. J Med Chem59:7125-37 (2016) 
 
Kallikrein-1
Name:Kallikrein-1
Type:Enzyme
Mol. Mass.:28874.69
Organism:Homo sapiens (Human)
Description:P06870
Residue:262
BDBM50191344
NameBDBM50191344
Synonyms:CHEMBL3951940
TypeSmall organic molecule
Emp. Form.C34H35N7O3
Mol. Mass.589.6868
SMILESC[C@H]1COC(=O)Nc2ccc(-c3ccnn3C)c(CN(C)C(=O)[C@H](Nc3ccc4c(N)nccc4c3)c3ccc1c(C)c3)c2