Reaction Details
TargetKallikrein-1
LigandBDBM50191345
Substrate/Competitorn/a
Meas. Tech.ChEMBL_1612859 (CHEMBL3854659)
Ki 260±n/a nM
Citation Zhang, XGlunz, PWJohnson, JAJiang, WJacutin-Porte, SLadziata, VZou, YPhillips, MSWurtz, NRParkhurst, BRendina, ARHarper, TMCheney, DLLuettgen, JMWong, PCSeiffert, DWexler, RRPriestley, ES Discovery of a Highly Potent, Selective, and Orally Bioavailable Macrocyclic Inhibitor of Blood Coagulation Factor VIIa-Tissue Factor Complex. J Med Chem59:7125-37 (2016) 
 
Kallikrein-1
Name:Kallikrein-1
Type:Enzyme
Mol. Mass.:28874.69
Organism:Homo sapiens (Human)
Description:P06870
Residue:262
BDBM50191345
NameBDBM50191345
Synonyms:CHEMBL3942944
TypeSmall organic molecule
Emp. Form.C32H33N5O5
Mol. Mass.567.6349
SMILESCOC(=O)c1ccc2NC(=O)OC[C@H](C)c3ccc(cc3C)[C@@H](Nc3ccc4c(N)nccc4c3)C(=O)N(C)Cc1c2