Reaction Details
TargetCoagulation factor X
LigandBDBM189427
Substrate/Competitorn/a
Meas. Tech.ChEMBL_1612855 (CHEMBL3854655)
Ki 3900±n/a nM
Citation Zhang, XGlunz, PWJohnson, JAJiang, WJacutin-Porte, SLadziata, VZou, YPhillips, MSWurtz, NRParkhurst, BRendina, ARHarper, TMCheney, DLLuettgen, JMWong, PCSeiffert, DWexler, RRPriestley, ES Discovery of a Highly Potent, Selective, and Orally Bioavailable Macrocyclic Inhibitor of Blood Coagulation Factor VIIa-Tissue Factor Complex. J Med Chem59:7125-37 (2016) 
 
Coagulation factor X
Name:Coagulation factor X
Type:Enzyme
Mol. Mass.:54726.60
Organism:Homo sapiens (Human)
Description:n/a
Residue:488
BDBM189427
NameBDBM189427
Synonyms:US9174974, Example 12
TypeSmall organic molecule
Emp. Form.C34H40N5O6P
Mol. Mass.645.6851
SMILESCCOP(=O)(OCC)c1ccc2NC(=O)OC[C@H](C)c3ccc(cc3C)[C@@H](Nc3ccc4c(N)nccc4c3)C(=O)N(C)Cc1c2