Reaction Details
TargetReceptor tyrosine-protein kinase erbB-4
LigandBDBM50191488
Substrate/Competitorn/a
Meas. Tech.ChEMBL_1613065 (CHEMBL3854865)
IC50 7.0±n/a nM
Citation Smaill, JBGonzales, AJSpicer, JALee, HReed, JESexton, KAlthaus, IWZhu, TBlack, SLBlaser, ADenny, WAEllis, PAFakhoury, SHarvey, PJHook, KMcCarthy, FOPalmer, BDRivault, FSchlosser, KEllis, TThompson, AMTrachet, EWinters, RTTecle, HBridges, A Tyrosine Kinase Inhibitors. 20. Optimization of Substituted Quinazoline and Pyrido[3,4-d]pyrimidine Derivatives as Orally Active, Irreversible Inhibitors of the Epidermal Growth Factor Receptor Family. J Med Chem59:8103-24 (2016) 
 
Receptor tyrosine-protein kinase erbB-4
Name:Receptor tyrosine-protein kinase erbB-4
Type:Protein
Mol. Mass.:146803.56
Organism:Homo sapiens (Human)
Description:Q15303
Residue:1308
BDBM50191488
NameBDBM50191488
Synonyms:CHEMBL3930506
TypeSmall organic molecule
Emp. Form.C22H22ClFN6O
Mol. Mass.440.901
SMILESFc1ccc(Nc2ncnc3cnc(NC(=O)\C=C\CN4CCCCC4)cc23)cc1Cl