Reaction Details
TargetReceptor tyrosine-protein kinase erbB-4
LigandBDBM50191661
Substrate/Competitorn/a
Meas. Tech.ChEMBL_1613065 (CHEMBL3854865)
IC50 2.0±n/a nM
Citation Smaill, JBGonzales, AJSpicer, JALee, HReed, JESexton, KAlthaus, IWZhu, TBlack, SLBlaser, ADenny, WAEllis, PAFakhoury, SHarvey, PJHook, KMcCarthy, FOPalmer, BDRivault, FSchlosser, KEllis, TThompson, AMTrachet, EWinters, RTTecle, HBridges, A Tyrosine Kinase Inhibitors. 20. Optimization of Substituted Quinazoline and Pyrido[3,4-d]pyrimidine Derivatives as Orally Active, Irreversible Inhibitors of the Epidermal Growth Factor Receptor Family. J Med Chem59:8103-24 (2016) 
 
Receptor tyrosine-protein kinase erbB-4
Name:Receptor tyrosine-protein kinase erbB-4
Type:Protein
Mol. Mass.:146803.56
Organism:Homo sapiens (Human)
Description:Q15303
Residue:1308
BDBM50191661
NameBDBM50191661
Synonyms:CHEMBL3890186
TypeSmall organic molecule
Emp. Form.C33H35N7O3
Mol. Mass.577.6761
SMILESCOCCOc1cc2ncnc(Nc3ccc4n(Cc5ccccc5)ncc4c3)c2cc1NC(=O)\C=C\CN1CCCC1